{"text_format":"1","workbook":"xlsx","n_sheets":6,"sheets":["現金出納帳","取引先テーブル","勘定科目消費税区分テーブル","データ基礎","絞込みデータ","弥生インポート形式仕訳日記帳"],"not_rendered":{"charts":0,"images":0,"macros":1,"external_links":0,"defined_names":3,"comments":0,"pivot_tables":0},"unopened":[],"bounds":{"document_bytes":16777216,"sheet_cells":100000,"rows_first":2000,"rows_last":500,"rows_between":2000,"halvings":0,"cell_chars":16384,"cell_head_chars":4096},"cells_cut":0,"cells_raw":0,"read":"whole","date_system":"1900"}

{"sheet":"現金出納帳","index":0,"n_rows":110,"n_cols":35,"rows_kept":110,"cut":false,"hidden":false,"merged":[[7,9,8,9],[2,7,2,8],[7,0,8,0],[7,1,8,1],[7,7,8,7],[7,8,8,8],[7,4,7,6],[7,2,8,2],[7,3,8,3]]}
[null,null,null,null,null,null,null,null,null,null,"１、期首日を入力してください"]
[null,null,null,null,null,null,null,null,null,null,"期首日を入力","2020-04-01",null,{"$f":"YEAR(L2)","v":2020},{"$f":"MONTH(L2)","v":4},{"$f":"DAY(L2)","v":1},{"$f":"TODAY()","v":"2022-06-30"},{"$f":"MONTH(Q2)","v":6},{"$f":"DAY(Q2)","v":30},null,{"$f":"L2","v":"2020-04-01"},{"$f":"MONTH(U2)","v":4},{"$f":"YEAR(U2)","v":2020},null,null,"年","月","日",null,"日付","日付"]
[null,null,null,null,null,null,null,null,null,null,"期末日",{"$f":"EDATE(L2,12)-1","v":"2021-03-31"},null,{"$f":"YEAR(L3)","v":2021},{"$f":"MONTH(L3)","v":3},{"$f":"DAY(L3)","v":31},null,null,null,null,{"$f":"EDATE(U2,1)","v":"2020-05-01"},{"$f":"MONTH(U3)","v":5},{"$f":"YEAR(U3)","v":2020},null,"開始",2016,4,1,{"$f":"DATE(Z3,AA3,AB3)","v":"2016-04-01"},{"$f":"\">=\"&AC3","v":">=42461"},{"$f":"\"<=\"&AC4","v":"<=42825"}]
[null,null,null,null,null,null,null,null,null,null,null,null,null,null,null,null,null,null,null,null,{"$f":"EDATE(U3,1)","v":"2020-06-01"},6,2020,null,"終了",2017,3,31,{"$f":"DATE(Z4,AA4,AB4)","v":"2017-03-31"}]
[null,null,null,null,null,null,null,null,null,null,"２、弥生会計の対象科目名を入力してください",null,null,null,null,null,null,null,null,null,"2020-07-01",7,2020]
[null,null,null,null,null,null,null,null,"提供：小林敬幸税理士事務所",null,"対象科目","現金",null,null,null,null,null,null,null,null,"2020-08-01",8,2020]
[null,null,null,null,null,null,null,null,null,null,"対象補助科目",null,null,{"$f":"IF(L7=\"\",\"\",L7)","v":""},null,null,null,null,null,null,"2020-09-01",9,2020]
["月","日","取引先","取引内容","勘定科目",null,null,"入金額","出金額","差引残高",null,null,null,null,null,null,null,null,null,null,"2020-10-01",10,2020]
[null,null,null,null,null,"科目名","補助科目",null,null,null,null,null,null,null,null,null,null,null,null,null,"2020-11-01",11,2020]
[{"$f":"O2","v":4},{"$f":"P2","v":1},null,null,null,"前期繰越",null,null,null,62841,null,null,null,null,null,null,null,null,null,null,"2020-12-01",12,2020,null,null,null,"借方勘定科目","借方補助科目","借方税区分","貸方勘定科目","貸方補助科目","貸方税区分","金額","摘要","日付"]
[4,1,"今野デザイン","ホームページ管理",{"$f":"C11&D11","v":"今野デザインホームページ管理"},"広告宣伝費",null,null,10500,{"$f":"IF(A11=\"\",\"\",J10+H11-I11)","v":52341},null,null,null,{"$f":"VLOOKUP(A11,$V$2:$W$13,2,FALSE)","v":2020},{"$f":"DATE(N11,A11,B11)","v":"2020-04-01"},null,null,null,null,null,"2021-01-01",1,2021,null,{"$f":"IF(F11=\"\",\"未確定勘定\",F11)","v":"広告宣伝費"},{"$f":"IF(G11=\"\",\"\",G11)","v":""},{"$f":"IF(I11=\"\",$L$6,IF(I11=0,$L$6,Y11))","v":"広告宣伝費"},{"$f":"IF(I11=\"\",$N$7,IF(I11=0,$N$7,Z11))","v":""},{"$f":"IF(ISERROR(VLOOKUP(AA11,勘定科目消費税区分テーブル!$B$9:$C$150,2,FALSE)),\"\",VLOOKUP(AA11,勘定科目消費税区分テーブル!$B$9:$C$150,2,FALSE))","v":"課対仕入10%"},{"$f":"IF(I11=\"\",Y11,IF(I11=0,Y11,$L$6))","v":"現金"},{"$f":"IF(I11=\"\",Z11,IF(I11=0,Z11,$N$7))","v":""},{"$f":"IF(ISERROR(VLOOKUP(AD11,勘定科目消費税区分テーブル!$B$9:$C$150,2,FALSE)),\"\",VLOOKUP(AD11,勘定科目消費税区分テーブル!$B$9:$C$150,2,FALSE))","v":"対象外"},{"$f":"IF(H11=\"\",I11,IF(H11=0,I11,H11))","v":10500},{"$f":"C11&\" \"&D11","v":"今野デザイン ホームページ管理"},{"$f":"TEXT(O11,\"yyyy/mm/dd\")","v":"2020/04/01"}]
[4,23,"坂本飯店","接待飲食",{"$f":"C12&D12","v":"坂本飯店接待飲食"},"交際費",null,null,5000,{"$f":"IF(A12=\"\",\"\",J11+H12-I12)","v":47341},null,null,null,{"$f":"VLOOKUP(A12,$V$2:$W$13,2,FALSE)","v":2020},{"$f":"DATE(N12,A12,B12)","v":"2020-04-23"},null,null,null,null,null,"2021-02-01",2,2021,null,{"$f":"IF(F12=\"\",\"未確定勘定\",F12)","v":"交際費"},{"$f":"IF(G12=\"\",\"\",G12)","v":""},{"$f":"IF(I12=\"\",$L$6,IF(I12=0,$L$6,Y12))","v":"交際費"},{"$f":"IF(I12=\"\",$N$7,IF(I12=0,$N$7,Z12))","v":""},{"$f":"IF(ISERROR(VLOOKUP(AA12,勘定科目消費税区分テーブル!$B$9:$C$150,2,FALSE)),\"\",VLOOKUP(AA12,勘定科目消費税区分テーブル!$B$9:$C$150,2,FALSE))","v":"課対仕入10%"},{"$f":"IF(I12=\"\",Y12,IF(I12=0,Y12,$L$6))","v":"現金"},{"$f":"IF(I12=\"\",Z12,IF(I12=0,Z12,$N$7))","v":""},{"$f":"IF(ISERROR(VLOOKUP(AD12,勘定科目消費税区分テーブル!$B$9:$C$150,2,FALSE)),\"\",VLOOKUP(AD12,勘定科目消費税区分テーブル!$B$9:$C$150,2,FALSE))","v":"対象外"},{"$f":"IF(H12=\"\",I12,IF(H12=0,I12,H12))","v":5000},{"$f":"C12&\" \"&D12","v":"坂本飯店 接待飲食"},{"$f":"TEXT(O12,\"yyyy/mm/dd\")","v":"2020/04/23"}]
[4,30,"JR",null,{"$f":"C13&D13","v":"JR"},"旅費交通費",null,null,3000,{"$f":"IF(A13=\"\",\"\",J12+H13-I13)","v":44341},null,null,null,{"$f":"VLOOKUP(A13,$V$2:$W$13,2,FALSE)","v":2020},{"$f":"DATE(N13,A13,B13)","v":"2020-04-30"},null,null,null,null,null,{"$f":"EDATE(U12,1)","v":"2021-03-01"},3,2021,null,"旅費交通費","","旅費交通費","",{"$f":"IF(ISERROR(VLOOKUP(AA13,勘定科目消費税区分テーブル!$B$9:$C$150,2,FALSE)),\"\",VLOOKUP(AA13,勘定科目消費税区分テーブル!$B$9:$C$150,2,FALSE))","v":"課対仕入10%"},"現金","",{"$f":"IF(ISERROR(VLOOKUP(AD13,勘定科目消費税区分テーブル!$B$9:$C$150,2,FALSE)),\"\",VLOOKUP(AD13,勘定科目消費税区分テーブル!$B$9:$C$150,2,FALSE))","v":"対象外"},3000,"JR ","2020/04/30"]
[5,1,"坂本飯店","接待飲食",{"$f":"C14&D14","v":"坂本飯店接待飲食"},"交際費",null,null,10800,{"$f":"IF(A14=\"\",\"\",J13+H14-I14)","v":33541},null,null,null,{"$f":"VLOOKUP(A14,$V$2:$W$13,2,FALSE)","v":2020},{"$f":"DATE(N14,A14,B14)","v":"2020-05-01"},null,null,null,null,null,null,null,null,null,"交際費","","交際費","",{"$f":"IF(ISERROR(VLOOKUP(AA14,勘定科目消費税区分テーブル!$B$9:$C$150,2,FALSE)),\"\",VLOOKUP(AA14,勘定科目消費税区分テーブル!$B$9:$C$150,2,FALSE))","v":"課対仕入10%"},"現金","",{"$f":"IF(ISERROR(VLOOKUP(AD14,勘定科目消費税区分テーブル!$B$9:$C$150,2,FALSE)),\"\",VLOOKUP(AD14,勘定科目消費税区分テーブル!$B$9:$C$150,2,FALSE))","v":"対象外"},10800,"坂本飯店 接待飲食","2020/05/01"]
[5,11,"坂本飯店","接待飲食",{"$f":"C15&D15","v":"坂本飯店接待飲食"},"交際費",null,null,24000,{"$f":"IF(A15=\"\",\"\",J14+H15-I15)","v":9541},null,null,null,{"$f":"VLOOKUP(A15,$V$2:$W$13,2,FALSE)","v":2020},{"$f":"DATE(N15,A15,B15)","v":"2020-05-11"},null,null,null,null,null,null,null,null,null,"交際費","","交際費","",{"$f":"IF(ISERROR(VLOOKUP(AA15,勘定科目消費税区分テーブル!$B$9:$C$150,2,FALSE)),\"\",VLOOKUP(AA15,勘定科目消費税区分テーブル!$B$9:$C$150,2,FALSE))","v":"課対仕入10%"},"現金","",{"$f":"IF(ISERROR(VLOOKUP(AD15,勘定科目消費税区分テーブル!$B$9:$C$150,2,FALSE)),\"\",VLOOKUP(AD15,勘定科目消費税区分テーブル!$B$9:$C$150,2,FALSE))","v":"対象外"},24000,"坂本飯店 接待飲食","2020/05/11"]
[5,20,"東灘信用金庫","預金より入金",{"$f":"C16&D16","v":"東灘信用金庫預金より入金"},"普通預金","東灘信金／御影",124566,null,{"$f":"IF(A16=\"\",\"\",J15+H16-I16)","v":134107},null,null,null,{"$f":"VLOOKUP(A16,$V$2:$W$13,2,FALSE)","v":2020},{"$f":"DATE(N16,A16,B16)","v":"2020-05-20"},null,null,null,null,null,null,null,null,null,"普通預金","東灘信金／御影","現金","",{"$f":"IF(ISERROR(VLOOKUP(AA16,勘定科目消費税区分テーブル!$B$9:$C$150,2,FALSE)),\"\",VLOOKUP(AA16,勘定科目消費税区分テーブル!$B$9:$C$150,2,FALSE))","v":"対象外"},"普通預金","東灘信金／御影",{"$f":"IF(ISERROR(VLOOKUP(AD16,勘定科目消費税区分テーブル!$B$9:$C$150,2,FALSE)),\"\",VLOOKUP(AD16,勘定科目消費税区分テーブル!$B$9:$C$150,2,FALSE))","v":"対象外"},124566,"東灘信用金庫 預金より入金","2020/05/20"]
[6,10,"クロネコ運輸",null,{"$f":"C17&D17","v":"クロネコ運輸"},"荷造運賃",null,null,1020,{"$f":"IF(A17=\"\",\"\",J16+H17-I17)","v":133087},null,null,null,{"$f":"VLOOKUP(A17,$V$2:$W$13,2,FALSE)","v":2020},{"$f":"DATE(N17,A17,B17)","v":"2020-06-10"},null,null,null,null,null,null,null,null,null,"荷造運賃","","荷造運賃","",{"$f":"IF(ISERROR(VLOOKUP(AA17,勘定科目消費税区分テーブル!$B$9:$C$150,2,FALSE)),\"\",VLOOKUP(AA17,勘定科目消費税区分テーブル!$B$9:$C$150,2,FALSE))","v":"課対仕入10%"},"現金","",{"$f":"IF(ISERROR(VLOOKUP(AD17,勘定科目消費税区分テーブル!$B$9:$C$150,2,FALSE)),\"\",VLOOKUP(AD17,勘定科目消費税区分テーブル!$B$9:$C$150,2,FALSE))","v":"対象外"},1020,"クロネコ運輸 ","2020/06/10"]
[6,20,"東灘信用金庫","預金より入金",{"$f":"C18&D18","v":"東灘信用金庫預金より入金"},"普通預金",null,80000,null,{"$f":"IF(A18=\"\",\"\",J17+H18-I18)","v":213087},null,null,null,{"$f":"VLOOKUP(A18,$V$2:$W$13,2,FALSE)","v":2020},{"$f":"DATE(N18,A18,B18)","v":"2020-06-20"},null,null,null,null,null,null,null,null,null,"普通預金","","現金","",{"$f":"IF(ISERROR(VLOOKUP(AA18,勘定科目消費税区分テーブル!$B$9:$C$150,2,FALSE)),\"\",VLOOKUP(AA18,勘定科目消費税区分テーブル!$B$9:$C$150,2,FALSE))","v":"対象外"},"普通預金","",{"$f":"IF(ISERROR(VLOOKUP(AD18,勘定科目消費税区分テーブル!$B$9:$C$150,2,FALSE)),\"\",VLOOKUP(AD18,勘定科目消費税区分テーブル!$B$9:$C$150,2,FALSE))","v":"対象外"},80000,"東灘信用金庫 預金より入金","2020/06/20"]
[7,1,"武田商店",null,{"$f":"C19&D19","v":"武田商店"},"買掛金","武田商店",null,30000,{"$f":"IF(A19=\"\",\"\",J18+H19-I19)","v":183087},null,null,null,{"$f":"VLOOKUP(A19,$V$2:$W$13,2,FALSE)","v":2020},{"$f":"DATE(N19,A19,B19)","v":"2020-07-01"},null,null,null,null,null,null,null,null,null,"買掛金","武田商店","買掛金","武田商店",{"$f":"IF(ISERROR(VLOOKUP(AA19,勘定科目消費税区分テーブル!$B$9:$C$150,2,FALSE)),\"\",VLOOKUP(AA19,勘定科目消費税区分テーブル!$B$9:$C$150,2,FALSE))","v":"対象外"},"現金","",{"$f":"IF(ISERROR(VLOOKUP(AD19,勘定科目消費税区分テーブル!$B$9:$C$150,2,FALSE)),\"\",VLOOKUP(AD19,勘定科目消費税区分テーブル!$B$9:$C$150,2,FALSE))","v":"対象外"},30000,"武田商店 ","2020/07/01"]
[7,25,"御影タクシー",null,{"$f":"C20&D20","v":"御影タクシー"},"旅費交通費",null,null,1080,{"$f":"IF(A20=\"\",\"\",J19+H20-I20)","v":182007},null,null,null,{"$f":"VLOOKUP(A20,$V$2:$W$13,2,FALSE)","v":2020},{"$f":"DATE(N20,A20,B20)","v":"2020-07-25"},null,null,null,null,null,null,null,null,null,"旅費交通費","","旅費交通費","",{"$f":"IF(ISERROR(VLOOKUP(AA20,勘定科目消費税区分テーブル!$B$9:$C$150,2,FALSE)),\"\",VLOOKUP(AA20,勘定科目消費税区分テーブル!$B$9:$C$150,2,FALSE))","v":"課対仕入10%"},"現金","",{"$f":"IF(ISERROR(VLOOKUP(AD20,勘定科目消費税区分テーブル!$B$9:$C$150,2,FALSE)),\"\",VLOOKUP(AD20,勘定科目消費税区分テーブル!$B$9:$C$150,2,FALSE))","v":"対象外"},1080,"御影タクシー ","2020/07/25"]
{"$rows_left_out":91}
{"sheet":"取引先テーブル","index":1,"n_rows":150,"n_cols":6,"rows_kept":150,"cut":false,"hidden":false,"merged":[]}
[]
[]
[]
[]
[]
[]
[]
[null,"取引先名","取引内容",null,"勘定科目","補助科目"]
[null,"JR",null,{"$f":"B9&C9","v":"JR"},"旅費交通費"]
[null,"一木運送",null,"一木運送","荷造運賃"]
[null,"今津文具店","事務用品","今津文具店事務用品","事務用品費"]
[null,"クロネコ運輸",null,"クロネコ運輸","荷造運賃"]
[null,"今野デザイン","ホームページ管理","今野デザインホームページ管理","広告宣伝費"]
[null,"坂本飯店","接待飲食","坂本飯店接待飲食","交際費"]
[null,"セブンマート",null,"セブンマート","消耗品費"]
[null,"武田商店",null,"武田商店","買掛金","武田商店"]
[null,"東灘信用金庫","預金より入金","東灘信用金庫預金より入金","普通預金","東灘信金／御影"]
[null,"郵便局",null,"郵便局","通信費"]
[null,null,null,""]
[null,null,null,""]
{"$rows_left_out":131}
{"sheet":"勘定科目消費税区分テーブル","index":2,"n_rows":150,"n_cols":7,"rows_kept":150,"cut":false,"hidden":false,"merged":[[91,5,95,5],[96,5,100,5],[101,5,105,5],[41,5,45,5],[46,5,50,5],[51,5,55,5],[56,5,60,5],[61,5,65,5],[71,5,75,5],[76,5,80,5],[81,5,85,5],[86,5,90,5],[10,5,14,5],[15,5,19,5],[20,5,24,5],[25,5,29,5],[66,5,70,5]]}
[]
[]
[]
[]
[]
[]
[]
[null,"勘定科目","税区分",null,null,"※消費税税区分一覧"]
[null,"現金","対象外",null,null,"取引の種類","税区分名"]
[null,"当座預金","対象外",null,null,"消費税と無関係な取引（不課税取引）","対象外"]
[null,"普通預金","対象外",null,null,"課税売上※","課税売上"]
[null,"定期預金","対象外",null,null,null,"課税売上10%"]
[null,"定期積金","対象外",null,null,null,"課税売上8%（軽）"]
[null,"郵便貯金","対象外",null,null,null,"課税売上8%"]
[null,"受取手形","対象外",null,null,null,"課税売上5%"]
[null,"売掛金","対象外",null,null,"課税売上にかかわる対価の返還※","課税売返"]
[null,"有価証券","対象外",null,null,null,"課税売返10%"]
[null,"前渡金","対象外",null,null,null,"課税売返8%（軽）"]
[null,"立替金","対象外",null,null,null,"課税売返8%"]
[null,"前払費用","対象外",null,null,null,"課税売返5%"]
{"$rows_left_out":131}
{"sheet":"データ基礎","index":3,"n_rows":22,"n_cols":26,"rows_kept":22,"cut":false,"hidden":false,"merged":[]}
[1,2,3,"1900-01-04",5,6,7,8,9,10,11,12,13,14,15,16,17,18,19,20,21,22,23,24,25,"日付"]
[2000,null,null,"2016/04/01","広告宣伝費","",null,"課対仕入込8%",10500,null,"現金","",null,"対象外",10500,null,"今野デザイン ホームページ管理",null,null,0,null,null,null,null,"no",{"$f":"DATEVALUE(D2)","v":42461}]
[2000,null,null,"2016/04/23","交際費","",null,"課対仕入込8%",5000,null,"現金","",null,"対象外",5000,null,"坂本飯店 接待飲食",null,null,0,null,null,null,null,"no",{"$f":"DATEVALUE(D3)","v":42483}]
[2000,null,null,"2016/04/30","旅費交通費","",null,"課対仕入込8%",3000,null,"現金","",null,"対象外",3000,null,"JR ",null,null,0,null,null,null,null,"no",42490]
[2000,null,null,"2016/05/01","交際費","",null,"課対仕入込8%",10800,null,"現金","",null,"対象外",10800,null,"坂本飯店 接待飲食",null,null,0,null,null,null,null,"no",42491]
[2000,null,null,"2016/05/11","交際費","",null,"課対仕入込8%",24000,null,"現金","",null,"対象外",24000,null,"坂本飯店 接待飲食",null,null,0,null,null,null,null,"no",42501]
[2000,null,null,"2016/05/20","現金","",null,"対象外",124566,null,"普通預金","東灘信金／御影",null,"対象外",124566,null,"東灘信用金庫 預金より入金",null,null,0,null,null,null,null,"no",42510]
[2000,null,null,"2016/06/10","荷造運賃","",null,"課対仕入込8%",1020,null,"現金","",null,"対象外",1020,null,"クロネコ運輸 ",null,null,0,null,null,null,null,"no",42531]
[2000,null,null,"2016/06/20","現金","",null,"対象外",80000,null,"普通預金","",null,"対象外",80000,null,"東灘信用金庫 預金より入金",null,null,0,null,null,null,null,"no",42541]
[2000,null,null,"2016/07/01","買掛金","武田商店",null,"対象外",30000,null,"現金","",null,"対象外",30000,null,"武田商店 ",null,null,0,null,null,null,null,"no",42552]
[2000,null,null,"2016/07/25","旅費交通費","",null,"課対仕入込8%",1080,null,"現金","",null,"対象外",1080,null,"御影タクシー ",null,null,0,null,null,null,null,"no",42576]
[2000,null,null,"2016/08/01","旅費交通費","",null,"課対仕入込8%",5000,null,"現金","",null,"対象外",5000,null,"JR ",null,null,0,null,null,null,null,"no",42583]
[2000,null,null,"2016/08/23","荷造運賃","",null,"課対仕入込8%",540,null,"現金","",null,"対象外",540,null,"クロネコ運輸 ",null,null,0,null,null,null,null,"no",42605]
[2000,null,null,"2016/09/20","広告宣伝費","",null,"課対仕入込8%",30000,null,"現金","",null,"対象外",30000,null,"今野デザイン ホームページ管理",null,null,0,null,null,null,null,"no",42633]
[2000,null,null,"2016/09/21","交際費","",null,"課対仕入込8%",4000,null,"現金","",null,"対象外",4000,null,"坂本飯店 接待飲食",null,null,0,null,null,null,null,"no",42634]
[2000,null,null,"2016/10/20","現金","",null,"対象外",24560,null,"普通預金","東灘信金／御影",null,"対象外",24560,null,"東灘信用金庫 預金より入金",null,null,0,null,null,null,null,"no",42663]
[2000,null,null,"2016/11/11","荷造運賃","",null,"課対仕入込8%",940,null,"現金","",null,"対象外",940,null,"クロネコ運輸 ",null,null,0,null,null,null,null,"no",42685]
[2000,null,null,"2016/11/12","交際費","",null,"課対仕入込8%",5400,null,"現金","",null,"対象外",5400,null,"坂本飯店 接待飲食",null,null,0,null,null,null,null,"no",42686]
[2000,null,null,"2016/11/12","荷造運賃","",null,"課対仕入込8%",5400,null,"現金","",null,"対象外",5400,null,"一木運送 ",null,null,0,null,null,null,null,"no",42686]
[2000,null,null,"2016/12/11","事務用品費","",null,"課対仕入込8%",500,null,"現金","",null,"対象外",500,null,"今津文具店 事務用品",null,null,0,null,null,null,null,"no",42715]
{"$rows_left_out":3}
{"sheet":"絞込みデータ","index":4,"n_rows":22,"n_cols":26,"rows_kept":22,"cut":false,"hidden":false,"merged":[]}
[1,2,3,"1900-01-04",5,6,7,8,9,10,11,12,13,14,15,16,17,18,19,20,21,22,23,24,25,"日付"]
[2000,null,null,"2016/04/01","広告宣伝費","",null,"課対仕入込8%",10500,null,"現金","",null,"対象外",10500,null,"今野デザイン ホームページ管理",null,null,0,null,null,null,null,"no",42461]
[2000,null,null,"2016/04/23","交際費","",null,"課対仕入込8%",5000,null,"現金","",null,"対象外",5000,null,"坂本飯店 接待飲食",null,null,0,null,null,null,null,"no",42483]
[2000,null,null,"2016/04/30","旅費交通費","",null,"課対仕入込8%",3000,null,"現金","",null,"対象外",3000,null,"JR ",null,null,0,null,null,null,null,"no",42490]
[2000,null,null,"2016/05/01","交際費","",null,"課対仕入込8%",10800,null,"現金","",null,"対象外",10800,null,"坂本飯店 接待飲食",null,null,0,null,null,null,null,"no",42491]
[2000,null,null,"2016/05/11","交際費","",null,"課対仕入込8%",24000,null,"現金","",null,"対象外",24000,null,"坂本飯店 接待飲食",null,null,0,null,null,null,null,"no",42501]
[2000,null,null,"2016/05/20","現金","",null,"対象外",124566,null,"普通預金","東灘信金／御影",null,"対象外",124566,null,"東灘信用金庫 預金より入金",null,null,0,null,null,null,null,"no",42510]
[2000,null,null,"2016/06/10","荷造運賃","",null,"課対仕入込8%",1020,null,"現金","",null,"対象外",1020,null,"クロネコ運輸 ",null,null,0,null,null,null,null,"no",42531]
[2000,null,null,"2016/06/20","現金","",null,"対象外",80000,null,"普通預金","",null,"対象外",80000,null,"東灘信用金庫 預金より入金",null,null,0,null,null,null,null,"no",42541]
[2000,null,null,"2016/07/01","買掛金","武田商店",null,"対象外",30000,null,"現金","",null,"対象外",30000,null,"武田商店 ",null,null,0,null,null,null,null,"no",42552]
[2000,null,null,"2016/07/25","旅費交通費","",null,"課対仕入込8%",1080,null,"現金","",null,"対象外",1080,null,"御影タクシー ",null,null,0,null,null,null,null,"no",42576]
[2000,null,null,"2016/08/01","旅費交通費","",null,"課対仕入込8%",5000,null,"現金","",null,"対象外",5000,null,"JR ",null,null,0,null,null,null,null,"no",42583]
[2000,null,null,"2016/08/23","荷造運賃","",null,"課対仕入込8%",540,null,"現金","",null,"対象外",540,null,"クロネコ運輸 ",null,null,0,null,null,null,null,"no",42605]
[2000,null,null,"2016/09/20","広告宣伝費","",null,"課対仕入込8%",30000,null,"現金","",null,"対象外",30000,null,"今野デザイン ホームページ管理",null,null,0,null,null,null,null,"no",42633]
[2000,null,null,"2016/09/21","交際費","",null,"課対仕入込8%",4000,null,"現金","",null,"対象外",4000,null,"坂本飯店 接待飲食",null,null,0,null,null,null,null,"no",42634]
[2000,null,null,"2016/10/20","現金","",null,"対象外",24560,null,"普通預金","東灘信金／御影",null,"対象外",24560,null,"東灘信用金庫 預金より入金",null,null,0,null,null,null,null,"no",42663]
[2000,null,null,"2016/11/11","荷造運賃","",null,"課対仕入込8%",940,null,"現金","",null,"対象外",940,null,"クロネコ運輸 ",null,null,0,null,null,null,null,"no",42685]
[2000,null,null,"2016/11/12","交際費","",null,"課対仕入込8%",5400,null,"現金","",null,"対象外",5400,null,"坂本飯店 接待飲食",null,null,0,null,null,null,null,"no",42686]
[2000,null,null,"2016/11/12","荷造運賃","",null,"課対仕入込8%",5400,null,"現金","",null,"対象外",5400,null,"一木運送 ",null,null,0,null,null,null,null,"no",42686]
[2000,null,null,"2016/12/11","事務用品費","",null,"課対仕入込8%",500,null,"現金","",null,"対象外",500,null,"今津文具店 事務用品",null,null,0,null,null,null,null,"no",42715]
{"$rows_left_out":3}
{"sheet":"弥生インポート形式仕訳日記帳","index":5,"n_rows":21,"n_cols":25,"rows_kept":21,"cut":false,"hidden":false,"merged":[]}
[2000,null,null,"2016/04/01","広告宣伝費","",null,"課対仕入込8%",10500,null,"現金","",null,"対象外",10500,null,"今野デザイン ホームページ管理",null,null,0,null,null,null,null,"no"]
[2000,null,null,"2016/04/23","交際費","",null,"課対仕入込8%",5000,null,"現金","",null,"対象外",5000,null,"坂本飯店 接待飲食",null,null,0,null,null,null,null,"no"]
[2000,null,null,"2016/04/30","旅費交通費","",null,"課対仕入込8%",3000,null,"現金","",null,"対象外",3000,null,"JR ",null,null,0,null,null,null,null,"no"]
[2000,null,null,"2016/05/01","交際費","",null,"課対仕入込8%",10800,null,"現金","",null,"対象外",10800,null,"坂本飯店 接待飲食",null,null,0,null,null,null,null,"no"]
[2000,null,null,"2016/05/11","交際費","",null,"課対仕入込8%",24000,null,"現金","",null,"対象外",24000,null,"坂本飯店 接待飲食",null,null,0,null,null,null,null,"no"]
[2000,null,null,"2016/05/20","現金","",null,"対象外",124566,null,"普通預金","東灘信金／御影",null,"対象外",124566,null,"東灘信用金庫 預金より入金",null,null,0,null,null,null,null,"no"]
[2000,null,null,"2016/06/10","荷造運賃","",null,"課対仕入込8%",1020,null,"現金","",null,"対象外",1020,null,"クロネコ運輸 ",null,null,0,null,null,null,null,"no"]
[2000,null,null,"2016/06/20","現金","",null,"対象外",80000,null,"普通預金","",null,"対象外",80000,null,"東灘信用金庫 預金より入金",null,null,0,null,null,null,null,"no"]
[2000,null,null,"2016/07/01","買掛金","武田商店",null,"対象外",30000,null,"現金","",null,"対象外",30000,null,"武田商店 ",null,null,0,null,null,null,null,"no"]
[2000,null,null,"2016/07/25","旅費交通費","",null,"課対仕入込8%",1080,null,"現金","",null,"対象外",1080,null,"御影タクシー ",null,null,0,null,null,null,null,"no"]
[2000,null,null,"2016/08/01","旅費交通費","",null,"課対仕入込8%",5000,null,"現金","",null,"対象外",5000,null,"JR ",null,null,0,null,null,null,null,"no"]
[2000,null,null,"2016/08/23","荷造運賃","",null,"課対仕入込8%",540,null,"現金","",null,"対象外",540,null,"クロネコ運輸 ",null,null,0,null,null,null,null,"no"]
[2000,null,null,"2016/09/20","広告宣伝費","",null,"課対仕入込8%",30000,null,"現金","",null,"対象外",30000,null,"今野デザイン ホームページ管理",null,null,0,null,null,null,null,"no"]
[2000,null,null,"2016/09/21","交際費","",null,"課対仕入込8%",4000,null,"現金","",null,"対象外",4000,null,"坂本飯店 接待飲食",null,null,0,null,null,null,null,"no"]
[2000,null,null,"2016/10/20","現金","",null,"対象外",24560,null,"普通預金","東灘信金／御影",null,"対象外",24560,null,"東灘信用金庫 預金より入金",null,null,0,null,null,null,null,"no"]
[2000,null,null,"2016/11/11","荷造運賃","",null,"課対仕入込8%",940,null,"現金","",null,"対象外",940,null,"クロネコ運輸 ",null,null,0,null,null,null,null,"no"]
[2000,null,null,"2016/11/12","交際費","",null,"課対仕入込8%",5400,null,"現金","",null,"対象外",5400,null,"坂本飯店 接待飲食",null,null,0,null,null,null,null,"no"]
[2000,null,null,"2016/11/12","荷造運賃","",null,"課対仕入込8%",5400,null,"現金","",null,"対象外",5400,null,"一木運送 ",null,null,0,null,null,null,null,"no"]
[2000,null,null,"2016/12/11","事務用品費","",null,"課対仕入込8%",500,null,"現金","",null,"対象外",500,null,"今津文具店 事務用品",null,null,0,null,null,null,null,"no"]
[2000,null,null,"2016/12/28","旅費交通費","",null,"課対仕入込8%",525,null,"現金","",null,"対象外",525,null,"JR ",null,null,0,null,null,null,null,"no"]
{"$rows_left_out":1}